BDBM50355652 CHEMBL1910963
SMILES OC(=O)c1ccccc1SCc1ccc(Cl)c(Cl)c1
InChI Key InChIKey=FKRTWCFFXQWRCJ-UHFFFAOYSA-N
Data  3 IC50
PDB links: 1 PDB ID matches this monomer.
  Tab Delimited (TSV)   2D SDfile   Computed 3D by Vconf -m prep SDfile
Find this compound or compounds like it in BindingDB:
Activity Spreadsheet -- Enzyme Inhibition Constant Data from BindingDB
Found 1 hit for monomerid = 50355652
TargetReceptor-type tyrosine-protein phosphatase gamma(Homo sapiens (Human))
Bristol-Myers Squibb Research And Development
Curated by ChEMBL
LigandPNGBDBM50355652(CHEMBL1910963)
Affinity DataIC50:  5.80E+3nM. Assay description: Inhibition of RPTPgamma expressed in Escherichia coli BL21 (DE3) assessed as reduction in dephosphorylation of Z'-Lyte phospho-Tyr 1 peptide preincub...